Target
Epidermal growth factor receptor [1-746,750-1210,A750P]
Ligand
BDBM50379214
Substrate
Meas. Tech.
Kinase Assay
pH
7.5±n/a
Temperature
303.15±n/a K
IC50
170±n/a nM
Comments
extracted
Citation
 Burnet, MWThaher, BAEhlert, JKubbutat, MSchaechtele, CTotzke, F Kinase modulators for the treatment of cancer US Patent  US9416123 Publication Date 8/16/2016 
Target
Name:
Epidermal growth factor receptor [1-746,750-1210,A750P]
Synonyms:
EGFR ERBB Epidermal growth factor receptor (EGFR)(del 747-749)(A750P) | HER1
Type:
Protein
Mol. Mass.:
133907.17
Organism:
Homo sapiens (Human)
Description:
d747-749 A750P
Residue:
1207
  
Inhibitor
Name:
BDBM50379214
Synonyms:
CHEMBL2011291 | US9416123, 6
Type:
Small organic molecule
Emp. Form.:
C20H12Cl3FN4
Mol. Mass.:
433.693
SMILES:
Nc1c(c(nn1-c1c(Cl)cc(Cl)cc1Cl)-c1ccncc1)-c1ccc(F)cc1
: