Target
Epidermal growth factor receptor [G719C]
Ligand
BDBM50379214
Substrate
Meas. Tech.
Kinase Assay
pH
7.5±n/a
Temperature
303.15±n/a K
IC50
1400±n/a nM
Comments
extracted
Citation
 Burnet, MWThaher, BAEhlert, JKubbutat, MSchaechtele, CTotzke, F Kinase modulators for the treatment of cancer US Patent  US9416123 Publication Date 8/16/2016 
Target
Name:
Epidermal growth factor receptor [G719C]
Synonyms:
EGF-R Tyrosine Kinase Mutant (G719C) EGFR (G719C) ERBB Epidermal growth factor receptor (EGFR)(G719C) | HER1
Type:
Tyrosine-protein kinase
Mol. Mass.:
134325.68
Organism:
Homo sapiens (Human)
Description:
gi_29725609
Residue:
1210
  
Inhibitor
Name:
BDBM50379214
Synonyms:
CHEMBL2011291 | US9416123, 6
Type:
Small organic molecule
Emp. Form.:
C20H12Cl3FN4
Mol. Mass.:
433.693
SMILES:
Nc1c(c(nn1-c1c(Cl)cc(Cl)cc1Cl)-c1ccncc1)-c1ccc(F)cc1
: