Target
Sphingosine kinase 2
Ligand
BDBM241906
Substrate
Meas. Tech.
Kinase Assay
Temperature
310.15±n/a K
Ki
500±n/a nM
Comments
extracted
Citation
 Lynch, KRMacdonald, TLMathews, TPKennedy, AKharel, Y Imidamide sphingosine kinase inhibitors US Patent  US9421177 Publication Date 8/23/2016 
Target
Name:
Sphingosine kinase 2
Synonyms:
SK 2 SPK 2 Sphingosine kinase 2 (SPHK2) | Sphk2
Type:
Enzyme
Mol. Mass.:
65617.92
Organism:
Mus musculus (Mouse)
Description:
Q9JIA7
Residue:
617
  
Inhibitor
Name:
BDBM241906
Synonyms:
US9421177, VPC96047
Type:
Small organic molecule
Emp. Form.:
C23H37N3O2
Mol. Mass.:
387.5588
SMILES:
CCCCCCCCCCCCc1ccc(cc1)C(=O)NC1(CC1)C(\N)=N\O
: