Target
Sphingosine kinase 2
Ligand
BDBM241932
Substrate
Meas. Tech.
Kinase Assay
Temperature
310.15±n/a K
Ki
2600±n/a nM
Comments
extracted
Citation
 Lynch, KRMacdonald, TLMathews, TPKennedy, AKharel, Y Imidamide sphingosine kinase inhibitors US Patent  US9421177 Publication Date 8/23/2016 
Target
Name:
Sphingosine kinase 2
Synonyms:
SK 2 SPK 2 Sphingosine kinase 2 (SPHK2) | Sphk2
Type:
Enzyme
Mol. Mass.:
65617.92
Organism:
Mus musculus (Mouse)
Description:
Q9JIA7
Residue:
617
  
Inhibitor
Name:
BDBM241932
Synonyms:
US9421177, VPC95291
Type:
Small organic molecule
Emp. Form.:
C20H39N3O2
Mol. Mass.:
353.5426
SMILES:
CCCCCCCCCCCCCCCC(=O)NC1(CC1)C(\N)=N\O
: