Target
Sphingosine kinase 2
Ligand
BDBM241937
Substrate
Meas. Tech.
Kinase Assay
Temperature
310.15±n/a K
Ki
1500±n/a nM
Comments
extracted
Citation
 Lynch, KRMacdonald, TLMathews, TPKennedy, AKharel, Y Imidamide sphingosine kinase inhibitors US Patent  US9421177 Publication Date 8/23/2016 
Target
Name:
Sphingosine kinase 2
Synonyms:
SK 2 SPK 2 Sphingosine kinase 2 (SPHK2) | Sphk2
Type:
Enzyme
Mol. Mass.:
65617.92
Organism:
Mus musculus (Mouse)
Description:
Q9JIA7
Residue:
617
  
Inhibitor
Name:
BDBM241937
Synonyms:
US9421177, VPC96091
Type:
Small organic molecule
Emp. Form.:
C24H39N3O2
Mol. Mass.:
401.5854
SMILES:
CCCCCCCCCCCCc1ccc(cc1)C(=O)N1CCC[C@H]1\C(N)=N\O
: