Target
Ribosomal protein S6 kinase alpha-3
Ligand
BDBM241956
Substrate
Meas. Tech.
RSK2 Inhibition Assay
pH
7.4±n/a
Temperature
298.15±n/a K
IC50
1.95e+3±n/a nM
Comments
extracted
Citation
 Xue, MXu, MLu, WHuang, JLi, HXu, YLiu, XZhao, Z Synthesis, activity evaluation, and docking analysis of barbituric acid aryl hydrazone derivatives as RSK2 inhibitors. J Enzyme Inhib Med Chem 28:747-52 (2013)  
Target
Name:
Ribosomal protein S6 kinase alpha-3
Synonyms:
90 kDa ribosomal protein S6 kinase 3 ISPK1 MAP kinase-activated protein kinase 1b RPS6KA3 RSK2 Ribosomal protein S6 kinase Ribosomal protein S6 kinase alpha-3 (RSK2) S6K-alpha 3 p90 ribosomal s6 kinase (RSK2) p90RSK | pp90RSK2
Type:
Serine/threonine-protein kinase
Mol. Mass.:
83740.03
Organism:
Homo sapiens (Human)
Description:
The human RSK2 sequence differed from the Genbank entry NM_004586 at one residue, V45G. The protein was cloned and purified from baculovirus expression system.
Residue:
740
  
Inhibitor
Name:
BDBM241956
Synonyms:
5-(2-(4-Hydroxyphenyl)hydrazono)pyrimidine-2,4,6(1H,3H,5H)-trione (9)
Type:
Small organic molecule
Emp. Form.:
C10H8N4O4
Mol. Mass.:
248.1949
SMILES:
[#8]-c1ccc(-[#7]\[#7]=[#6]-2\[#6](=O)-[#7]-[#6](=O)-[#7]-[#6]-2=O)cc1
: