Target
Transient receptor potential cation channel subfamily V member 1
Ligand
BDBM245008
Substrate
Meas. Tech.
Functional Assay
Temperature
310.15±n/a K
IC50
20±n/a nM
Comments
extracted
Citation
 Allison, BDBranstetter, BJBreitenbucher, JGHack, MDHawryluk, NALebsack, ADMcClure, KJMerit, JE Tetrahydro-pyrimidoazepines as modulators of TRPV1 US Patent  US9422293 Publication Date 8/23/2016 
Target
Name:
Transient receptor potential cation channel subfamily V member 1
Synonyms:
Capsaicin receptor TRPV1_RAT Trpv1 Vanilloid VR1 Vanilloid receptor 1 (VRI/TRPV1) Vanilloid receptor type 1-like (TrpV1/Vr1) Vr1l | osm-9-like TRP channel 1
Type:
Transient Receptor
Mol. Mass.:
94956.12
Organism:
Rattus norvegicus (rat)
Description:
O35433
Residue:
838
  
Inhibitor
Name:
BDBM245008
Synonyms:
US9422293, 245 | US9738649, Example 245
Type:
Small organic molecule
Emp. Form.:
C26H25ClF6N6O
Mol. Mass.:
586.96
SMILES:
FC(F)(F)c1ccc(Nc2nc(nc3CCN(CCc23)c2ncccc2C(F)(F)F)N2CCCOCC2)cc1Cl
: