Target
Transient receptor potential cation channel subfamily V member 1
Ligand
BDBM245124
Substrate
Meas. Tech.
Functional Assay
Temperature
310.15±n/a K
IC50
20±n/a nM
Comments
extracted
Citation
 Allison, BDBranstetter, BJBreitenbucher, JGHack, MDHawryluk, NALebsack, ADMcClure, KJMerit, JE Tetrahydro-pyrimidoazepines as modulators of TRPV1 US Patent  US9422293 Publication Date 8/23/2016 
Target
Name:
Transient receptor potential cation channel subfamily V member 1
Synonyms:
Capsaicin receptor TRPV1_RAT Trpv1 Vanilloid VR1 Vanilloid receptor 1 (VRI/TRPV1) Vanilloid receptor type 1-like (TrpV1/Vr1) Vr1l | osm-9-like TRP channel 1
Type:
Transient Receptor
Mol. Mass.:
94956.12
Organism:
Rattus norvegicus (rat)
Description:
O35433
Residue:
838
  
Inhibitor
Name:
BDBM245124
Synonyms:
US9422293, 368 US9738649, Example 369
Type:
Small organic molecule
Emp. Form.:
C27H27F6N5OS
Mol. Mass.:
583.592
SMILES:
CC1OCCC1Sc1nc2CCN(CCc2c(Nc2ccc(cc2C)C(F)(F)F)n1)c1ncccc1C(F)(F)F
: