Target
Proto-oncogene tyrosine-protein kinase Src
Ligand
BDBM6525
Substrate
Biotinylated peptide substrate
Meas. Tech.
Homogeneous Time-resolved Fluorescence (HTRF) Assay
pH
7.5±n/a
Temperature
310.15±n/a K
IC50
89±28 nM
Citation
 Barrios Sosa, ACBoschelli, DHWu, BWang, YGolas, JM Further studies on ethenyl and ethynyl-4-phenylamino-3-quinolinecarbonitriles: identification of a subnanomolar Src kinase inhibitor. Bioorg Med Chem Lett 15:1743-7 (2005)  
Target
Name:
Proto-oncogene tyrosine-protein kinase Src
Synonyms:
Calmodulin/Proto-oncogene tyrosine-protein kinase Src Proto-oncogene c-Src SRC SRC_HUMAN V-src sarcoma (Schmidt-Ruppin A-2) viral oncogene homolog (avian) p60-Src | pp60c-src
Type:
Protein
Mol. Mass.:
59838.60
Organism:
Homo sapiens (Human)
Description:
P12931
Residue:
536
  
Inhibitor
Name:
BDBM6525
Synonyms:
7-[2-(pyridin-3-yl)ethynyl]-4-[(3,4,5-trimethoxyphenyl)amino]quinoline-3-carbonitrile | ethynyl-4-phenylamino-3-quinolinecarbonitrile 7
Type:
Small organic molecule
Emp. Form.:
C26H20N4O3
Mol. Mass.:
436.462
SMILES:
COc1cc(Nc2c(cnc3cc(ccc23)C#Cc2cccnc2)C#N)cc(OC)c1OC
:
Substrate
Name:
Biotinylated peptide substrate
Synonyms:
Type:
Peptide
Mol. Mass.:
2353.23
Organism:
Description:
Biotinylated peptide corresponding to residues 6 to 20 of Cdk1. 100 uM ATP as co-substrate.
Residue:
21