Target
Genome polyprotein [2420-3010]
Ligand
BDBM243476
Substrate
Meas. Tech.
Surface Plasmon Resonance (SPR)-Based Assay
pH
7.4±n/a
Temperature
298.15±n/a K
Kd
760±n/a nM
Comments
extracted
Citation
 Vendeville, SMRaboisson, PJLin, TTahri, AAmssoms, KI Macrocyclic indole derivatives useful as hepatitis C virus inhibitors US Patent  US9427440 Publication Date 8/30/2016 
Target
Name:
Genome polyprotein [2420-3010]
Synonyms:
POLG_HCVCO RNA-directed RNA polymerase (NS5B)
Type:
Enzyme
Mol. Mass.:
65783.36
Organism:
Hepatitis C virus genotype 1b (isolate Con1) (HCV)
Description:
aa 2420-3010
Residue:
591
  
Inhibitor
Name:
BDBM243476
Synonyms:
US9427440, 24
Type:
Small organic molecule
Emp. Form.:
C31H35ClN4O4S
Mol. Mass.:
595.152
SMILES:
CN1CCCCN(C)S(=O)(=O)NC(=O)c2ccc3c(C4CCCCC4)c4-c5cc(Cl)ccc5C=C(Cn4c3c2)C1=O
: