Target
Coagulation factor X
Ligand
BDBM294042
Substrate
Meas. Tech.
Human Coagulation Factor Xa Assay
pH
8.3±n/a
Ki
1.92±n/a nM
Comments
extracted
Citation
 Chen, SDing, ZGong, GYan, XHuang, WGuo, FDuan, BGao, RZhou, PLu, XDong, G Preparation method for benzoxazoleoxazine ketone compound and intermediate and crystal form thereof US Patent  US10106557 Publication Date 10/23/2018 
Target
Name:
Coagulation factor X
Synonyms:
Activated coagulation factor X (FXa) Coagulation factor X precursor F10 Factor X heavy chain Factor Xa Stuart-Prower factor
Type:
Enzyme
Mol. Mass.:
54726.60
Organism:
Homo sapiens (Human)
Description:
Residue:
488
  
Inhibitor
Name:
BDBM294042
Synonyms:
US10106557, Compound 8
Type:
Small organic molecule
Emp. Form.:
C21H16ClN3O5S
Mol. Mass.:
457.887
SMILES:
Clc1ccc(s1)C(=O)NC[C@@H]1OC(=O)N2[C@H]1COc1cc(ccc21)-n1ccccc1=O
: