Target
Voltage-dependent L-type calcium channel subunit beta-3/N-type calcium channel subunit alpha-1B/calcium channel subunit alpha-2/delta-1
Ligand
BDBM246332
Substrate
Meas. Tech.
Functional Drug Screening System (FDSS)
IC50
85±n/a nM
Citation
 Wall, MSubasinghe, NSui, ZFlores, C Substituted pyrazoles as N-type calcium channel blockers US Patent  US9434693 Publication Date 9/6/2016 
Target
Name:
Voltage-dependent L-type calcium channel subunit beta-3/N-type calcium channel subunit alpha-1B/calcium channel subunit alpha-2/delta-1
Synonyms:
N-type calcium channel subunits alpha 1B (Cav2.2) Beta 3 and Alpha 2 Delta | N-type calcium channel subunits alpha 1B (Cav2.2), Beta 3, and Alpha 2 Delta
Type:
Enzyme
Mol. Mass.:
Description:
Components:
This complex has 3 components.
Component 1
Name:
Voltage-dependent N-type calcium channel subunit alpha-1B
Synonyms:
BIII CAC1B_HUMAN CACNA1B Calcium channel (Type N) Voltage-dependent N-type calcium channel subunit alpha-1B Voltage-gated N-type calcium channel alpha-1B subunit Voltage-gated calcium channel Voltage-gated calcium channel subunit alpha Cav2.2 ((alpha 1B, beta 1b, alpha 2 delta-1) | calcium channel, voltage-dependent, N type, alpha 1B subunit
Type:
Enzyme
Mol. Mass.:
262548.16
Organism:
Homo sapiens (Human)
Description:
Q00975
Residue:
2339
  
Component 2
Name:
Voltage-dependent L-type calcium channel subunit beta-3
Synonyms:
CACB3_HUMAN CACNLB3 | Calcium channel voltage-dependent subunit beta 3
Type:
Enzyme
Mol. Mass.:
54529.25
Organism:
Homo sapiens (Human)
Description:
P54284
Residue:
484
  
Component 3
Name:
Voltage-dependent calcium channel subunit alpha-2/delta-1
Synonyms:
CA2D1_HUMAN CACNL2A MHS3 Voltage-dependent calcium channel subunit delta-1 Voltage-gated calcium channel alpha2/delta subunit 1 | Voltage-gated calcium channel subunit alpha-2/delta-1
Type:
Enzyme
Mol. Mass.:
124544.88
Organism:
Homo sapiens (Human)
Description:
P54289
Residue:
1103
  
Inhibitor
Name:
BDBM246332
Synonyms:
US9434693, 27
Type:
Small organic molecule
Emp. Form.:
C26H22ClN3O3
Mol. Mass.:
459.924
SMILES:
COc1ccccc1-n1nc(OC2CN(C2)C(=O)c2ccccc2)cc1-c1ccc(Cl)cc1
: