Target
Carbonic anhydrase 1
Ligand
BDBM246556
Substrate
Meas. Tech.
Thermal Shift Assay (TSA)
pH
7±n/a
Kd
2500±n/a nM
Comments
extracted
Citation
 Zubriene, ACapkauskaite, EGylyte, JKi?onaite, MTumkevicius, SMatulis, D Benzenesulfonamides with benzimidazole moieties as inhibitors of carbonic anhydrases I, II, VII, XII and XIII. J Enzyme Inhib Med Chem 29:124-31 (2014)  
Target
Name:
Carbonic anhydrase 1
Synonyms:
CA-I CAB Carbonate dehydratase I Carbonic anhydrase 1 (CA I) Carbonic anhydrase 1 (Recombinant CA I) Carbonic anhydrase B Carbonic anhydrase I (CA I) Carbonic anhydrase I (CAI) Carbonic anhydrase isoenzyme I (hCA I) | hCA
Type:
Enzyme
Mol. Mass.:
28873.37
Organism:
Homo sapiens (Human)
Description:
P00915
Residue:
261
  
Inhibitor
Name:
BDBM246556
Synonyms:
3-[(2-Benzyl-1H-benzimidazol-1-yl)acetyl]benzenesulfonamide (3d)
Type:
Small organic molecule
Emp. Form.:
C22H19N3O3S
Mol. Mass.:
405.47
SMILES:
NS(=O)(=O)c1cccc(c1)C(=O)Cn1c(Cc2ccccc2)nc2ccccc12
: