Target
Carbonic anhydrase 7
Ligand
BDBM246559
Substrate
Meas. Tech.
Thermal Shift Assay (TSA)
pH
7±n/a
Kd
25000±n/a nM
Comments
extracted
Citation
 Zubriene, ACapkauskaite, EGylyte, JKi?onaite, MTumkevicius, SMatulis, D Benzenesulfonamides with benzimidazole moieties as inhibitors of carbonic anhydrases I, II, VII, XII and XIII. J Enzyme Inhib Med Chem 29:124-31 (2014)  
Target
Name:
Carbonic anhydrase 7
Synonyms:
CA-VII CAH7_HUMAN Carbonic anhydrase Carbonic anhydrase VII (CA VII)
Type:
Enzyme
Mol. Mass.:
29664.11
Organism:
Homo sapiens (Human)
Description:
Human cloned isozyme.
Residue:
264
  
Inhibitor
Name:
BDBM246559
Synonyms:
3-[(2-Ethyl-1H-benzimidazol-1-yl)acetyl]benzenesulfonamide (3e)
Type:
Small organic molecule
Emp. Form.:
C17H17N3O3S
Mol. Mass.:
343.4
SMILES:
CCc1nc2ccccc2n1CC(=O)c1cccc(c1)S(N)(=O)=O
: