Target
Carbonic anhydrase 2
Ligand
BDBM246590
Substrate
Meas. Tech.
Esterase Activity Assay
pH
7.4±n/a
Temperature
298.15±n/a K
Ki
9230±2730 nM
Citation
 Çetinkaya, YGöçer, HGöksu, SGülçin, Ä° Synthesis and carbonic anhydrase isoenzymes I and II inhibitory effects of novel benzylamine derivatives. J Enzyme Inhib Med Chem 29:168-74 (2014)  
Target
Name:
Carbonic anhydrase 2
Synonyms:
CA-II CAC Carbonate dehydratase II Carbonic anhydrase 2 (CA-II) Carbonic anhydrase C Carbonic anhydrase II (CA-II) Carbonic anhydrase II (hCA II) | Carbonic anhydrase isoenzyme II (hCA II)
Type:
Enzyme
Mol. Mass.:
29250.71
Organism:
Homo sapiens (Human)
Description:
P00918
Residue:
260
  
Inhibitor
Name:
BDBM246590
Synonyms:
N-((2,3-dimethoxyphenyl)(3,4-dimethoxyphenyl)methyl)methanesulfonamide (28)
Type:
Small organic molecule
Emp. Form.:
C18H23NO6S
Mol. Mass.:
381.443
SMILES:
COc1ccc(cc1OC)C(NS(C)(=O)=O)c1cccc(OC)c1OC
: