Target
Carbonic anhydrase 1
Ligand
BDBM246585
Substrate
Meas. Tech.
Esterase Activity Assay
pH
7.4±0
Temperature
298.15±0 K
Ki
3.604e+4± 2.81e+3 nM
Citation
 Çetinkaya, YGöçer, HGöksu, SGülçin, Ä° Synthesis and carbonic anhydrase isoenzymes I and II inhibitory effects of novel benzylamine derivatives. J Enzyme Inhib Med Chem 29:168-74 (2014)  
Target
Name:
Carbonic anhydrase 1
Synonyms:
CA-I CAB Carbonate dehydratase I Carbonic anhydrase 1 (CA I) Carbonic anhydrase 1 (Recombinant CA I) Carbonic anhydrase B Carbonic anhydrase I (CA I) Carbonic anhydrase I (CAI) Carbonic anhydrase isoenzyme I (hCA I) | hCA
Type:
Enzyme
Mol. Mass.:
28873.37
Organism:
Homo sapiens (Human)
Description:
P00915
Residue:
261
  
Inhibitor
Name:
BDBM246585
Synonyms:
(2,4-Dimethoxyphenyl)(3,4-dimethoxyphenyl)methanamine hydrochloride (23)
Type:
Small organic molecule
Emp. Form.:
C17H21NO4
Mol. Mass.:
303.3529
SMILES:
COc1ccc(C(N)c2ccc(OC)c(OC)c2)c(OC)c1
: