Target
DNA topoisomerase I/type IB small subunit
Ligand
BDBM246595
Substrate
Meas. Tech.
Preincubation Relaxation Assay
pH
7.5±n/a
IC50
2.8e+3± 1.1e+3 nM
Comments
extracted
Citation
 Sharma, GChowdhury, SSinha, SMajumder, HKKumar, SV Antileishmanial activity evaluation of bis-lawsone analogs and DNA topoisomerase-I inhibition studies. J Enzyme Inhib Med Chem 29:185-9 (2014)  
Target
Name:
DNA topoisomerase I/type IB small subunit
Synonyms:
DNA topoisomerase IB
Type:
Protein
Mol. Mass.:
Description:
Bi-subunit type IB topoisomerase
Components:
This complex has 2 components.
Component 1
Name:
DNA topoisomerase type IB small subunit
Synonyms:
DNA topoisomerase IB small subunit
Type:
Protein
Mol. Mass.:
28120.90
Organism:
Leishmania donovani
Description:
E9B7X3
Residue:
262
  
Component 2
Name:
DNA topoisomerase I
Synonyms:
DNA topoisomerase IB large subunit
Type:
Protein
Mol. Mass.:
73610.41
Organism:
Leishmania donovani
Description:
E9BRC0
Residue:
635
  
Inhibitor
Name:
BDBM246595
Synonyms:
Camptothecin (CPT)
Type:
Small organic molecule
Emp. Form.:
C20H18N2O3
Mol. Mass.:
334.3685
SMILES:
CC[C@@]1(O)C(=O)OCC2=CN3Cc4cc5ccccc5nc4C3C=C12
: