Target
Neuronal acetylcholine receptor subunit alpha-7
Ligand
BDBM248003
Substrate
Meas. Tech.
Radioligand Binding Assay
pH
7.4±n/a
Temperature
310.15±n/a K
Ki
75.05±n/a nM
IC50
86.55±n/a nM
Comments
extracted
Citation
 Bilcer, GMNg, R Quinuclidines for modulating alpha 7 activity US Patent  US9434724 Publication Date 9/6/2016 
Target
Name:
Neuronal acetylcholine receptor subunit alpha-7
Synonyms:
ACHA7_RAT Cholinergic, Nicotinic Alpha7 Chrna7 Neuronal acetylcholine receptor (alpha7 nAChR) Neuronal acetylcholine receptor subunit alpha-7 Neuronal acetylcholine receptor subunit alpha-7 (nAChR)
Type:
Enzyme
Mol. Mass.:
56502.44
Organism:
Rattus norvegicus (Rat)
Description:
Q05941
Residue:
502
  
Inhibitor
Name:
BDBM248003
Synonyms:
US9434724, 12
Type:
Small organic molecule
Emp. Form.:
C17H19FN2O2
Mol. Mass.:
302.3434
SMILES:
Fc1ccc2[nH]cc(C(=O)OCC34CCN(CC3)CC4)c2c1
: