Target
Neuronal acetylcholine receptor subunit alpha-7
Ligand
BDBM247989
Substrate
Meas. Tech.
Radioligand Binding Assay
pH
7.4±n/a
Temperature
310.15±n/a K
Ki
341±n/a nM
IC50
396±n/a nM
Comments
extracted
Citation
 Bilcer, GMNg, R Quinuclidines for modulating alpha 7 activity US Patent  US9434724 Publication Date 9/6/2016 
Target
Name:
Neuronal acetylcholine receptor subunit alpha-7
Synonyms:
ACHA7_RAT Cholinergic, Nicotinic Alpha7 Chrna7 Neuronal acetylcholine receptor (alpha7 nAChR) Neuronal acetylcholine receptor subunit alpha-7 Neuronal acetylcholine receptor subunit alpha-7 (nAChR)
Type:
Enzyme
Mol. Mass.:
56502.44
Organism:
Rattus norvegicus (Rat)
Description:
Q05941
Residue:
502
  
Inhibitor
Name:
BDBM247989
Synonyms:
US9434724, 38
Type:
Small organic molecule
Emp. Form.:
C18H21ClN2O3
Mol. Mass.:
348.824
SMILES:
COc1cc(Cl)c2c(c[nH]c2c1)C(=O)OCC12CCN(CC1)CC2
: