Target
Neuronal acetylcholine receptor subunit alpha-7
Ligand
BDBM247971
Substrate
Meas. Tech.
Radioligand Binding Assay
pH
7.4±n/a
Temperature
310.15±n/a K
Ki
46±n/a nM
IC50
53.6±n/a nM
Comments
extracted
Citation
 Bilcer, GMNg, R Quinuclidines for modulating alpha 7 activity US Patent  US9434724 Publication Date 9/6/2016 
Target
Name:
Neuronal acetylcholine receptor subunit alpha-7
Synonyms:
ACHA7_RAT Cholinergic, Nicotinic Alpha7 Chrna7 Neuronal acetylcholine receptor (alpha7 nAChR) Neuronal acetylcholine receptor subunit alpha-7 Neuronal acetylcholine receptor subunit alpha-7 (nAChR)
Type:
Enzyme
Mol. Mass.:
56502.44
Organism:
Rattus norvegicus (Rat)
Description:
Q05941
Residue:
502
  
Inhibitor
Name:
BDBM247971
Synonyms:
US9434724, 53
Type:
Small organic molecule
Emp. Form.:
C17H19BrN2O3
Mol. Mass.:
379.248
SMILES:
Oc1cc(Br)c2c(c[nH]c2c1)C(=O)OCC12CCN(CC1)CC2
: