Target
Neuronal acetylcholine receptor subunit alpha-7
Ligand
BDBM247986
Substrate
Meas. Tech.
Alpha-Bungarotoxin Binding Assay
pH
8±n/a
Temperature
310.15±n/a K
Ki
229.8±n/a nM
IC50
162.2±n/a nM
Comments
extracted
Citation
 Bilcer, GMNg, R Quinuclidines for modulating alpha 7 activity US Patent  US9434724 Publication Date 9/6/2016 
Target
Name:
Neuronal acetylcholine receptor subunit alpha-7
Synonyms:
ACHA7_RAT Cholinergic, Nicotinic Alpha7 Chrna7 Neuronal acetylcholine receptor (alpha7 nAChR) Neuronal acetylcholine receptor subunit alpha-7 Neuronal acetylcholine receptor subunit alpha-7 (nAChR)
Type:
Enzyme
Mol. Mass.:
56502.44
Organism:
Rattus norvegicus (Rat)
Description:
Q05941
Residue:
502
  
Inhibitor
Name:
BDBM247986
Synonyms:
US9434724, 94
Type:
Small organic molecule
Emp. Form.:
C20H23F3N2O3
Mol. Mass.:
396.4034
SMILES:
Cc1c(OCC(F)(F)F)ccc2[nH]cc(C(=O)OCC34CCN(CC3)CC4)c12
: