Target
Fibroblast growth factor receptor 2
Ligand
BDBM25115
Substrate
Meas. Tech.
Inhibition Assay
IC50
8.79±n/a nM
Citation
 Bingaman, DPChaney, PGWax, MB Ocular formulations for drug-delivery to the posterior segment of the eye US Patent  US9446026 Publication Date 9/20/2016 
Target
Name:
Fibroblast growth factor receptor 2
Synonyms:
BEK FGFR-2 FGFR2 Fibroblast growth factor receptor 2 (FGFR2) KGFR Keratinocyte growth factor receptor VEGF-receptor 2 and Fibroblast growth factor receptor 2
Type:
Enzyme
Mol. Mass.:
92015.45
Organism:
Homo sapiens (Human)
Description:
P21802
Residue:
821
  
Inhibitor
Name:
BDBM25115
Synonyms:
3-[(4-bromo-2,6-difluorophenyl)methoxy]-5-({[4-(pyrrolidin-1-yl)butyl]carbamoyl}amino)-1,2-thiazole-4-carboxamide CP 547632 US9446026, 1
Type:
Small organic molecule
Emp. Form.:
C20H24BrF2N5O3S
Mol. Mass.:
532.402
SMILES:
NC(=O)c1c(NC(=O)NCCCCN2CCCC2)snc1OCc1c(F)cc(Br)cc1F
: