Target
Platelet-derived growth factor receptor beta
Ligand
BDBM25115
Substrate
Meas. Tech.
Inhibition Assay
IC50
2636.67±n/a nM
Citation
 Bingaman, DPChaney, PGWax, MB Ocular formulations for drug-delivery to the posterior segment of the eye US Patent  US9446026 Publication Date 9/20/2016 
Target
Name:
Platelet-derived growth factor receptor beta
Synonyms:
Beta-type platelet-derived growth factor receptor CD140b antigen PDGF Receptor Substrate PDGFR PDGFR-1 PDGFRB PGFRB_HUMAN Platelet-derived growth factor receptor 1 Platelet-derived growth factor receptor beta (PDGFR-beta) Platelet-derived growth factor receptor beta (PDGFRbeta) | VHL/PDGFRB
Type:
Enzyme
Mol. Mass.:
123922.25
Organism:
Homo sapiens (Human)
Description:
P09619
Residue:
1106
  
Inhibitor
Name:
BDBM25115
Synonyms:
3-[(4-bromo-2,6-difluorophenyl)methoxy]-5-({[4-(pyrrolidin-1-yl)butyl]carbamoyl}amino)-1,2-thiazole-4-carboxamide CP 547632 US9446026, 1
Type:
Small organic molecule
Emp. Form.:
C20H24BrF2N5O3S
Mol. Mass.:
532.402
SMILES:
NC(=O)c1c(NC(=O)NCCCCN2CCCC2)snc1OCc1c(F)cc(Br)cc1F
: