Target
Vascular endothelial growth factor receptor 3
Ligand
BDBM25115
Substrate
Meas. Tech.
In Vitro Inhibition Assay
IC50
54.2±n/a nM
Citation
 Bingaman, DPChaney, PGWax, MB Ocular formulations for drug-delivery to the posterior segment of the eye US Patent  US9446026 Publication Date 9/20/2016 
Target
Name:
Vascular endothelial growth factor receptor 3
Synonyms:
FLT-4 Fms-like tyrosine kinase 4 VEGFR-3 VGFR3_HUMAN Vascular endothelial growth factor receptor 3 (VEGFR-3) | Vascular endothelial growth factor receptor 3 (VEGFR3)
Type:
Protein
Mol. Mass.:
152749.58
Organism:
Homo sapiens (Human)
Description:
P35916-2
Residue:
1363
  
Inhibitor
Name:
BDBM25115
Synonyms:
3-[(4-bromo-2,6-difluorophenyl)methoxy]-5-({[4-(pyrrolidin-1-yl)butyl]carbamoyl}amino)-1,2-thiazole-4-carboxamide CP 547632 US9446026, 1
Type:
Small organic molecule
Emp. Form.:
C20H24BrF2N5O3S
Mol. Mass.:
532.402
SMILES:
NC(=O)c1c(NC(=O)NCCCCN2CCCC2)snc1OCc1c(F)cc(Br)cc1F
: