Target
Carbonic anhydrase
Ligand
BDBM50607
Substrate
Meas. Tech.
CA Inhibition Assay
pH
7.4±n/a
Temperature
298.15±n/a K
Ki
76500±n/a nM
Comments
extracted
Citation
 Bilginer, SUnluer, EGul, HIMete, EIsik, SVullo, DOzensoy-Guler, OBeyaztas, SCapasso, CSupuran, CT Carbonic anhydrase inhibitors. Phenols incorporating 2- or 3-pyridyl-ethenylcarbonyl and tertiary amine moieties strongly inhibit Saccharomyces cerevisiae ß-carbonic anhydrase. J Enzyme Inhib Med Chem 29:495-9 (2014)  
Target
Name:
Carbonic anhydrase
Synonyms:
β-Carbonic anhydrase (CA)
Type:
Enzyme
Mol. Mass.:
24861.97
Organism:
Saccharomyces cerevisiae (Baker's yeast)
Description:
P53615
Residue:
221
  
Inhibitor
Name:
BDBM50607
Synonyms:
(E)-1-(4-Hydroxy-phenyl)-3-pyridin-3-yl-propenone (E)-1-(4-hydroxyphenyl)-3-(3-pyridyl)prop-2-en-1-one (E)-1-(4-hydroxyphenyl)-3-pyridin-3-ylprop-2-en-1-one MLS000778012 cid_5920835
Type:
Small organic molecule
Emp. Form.:
C14H11NO2
Mol. Mass.:
225.2426
SMILES:
Oc1ccc(cc1)C(=O)\C=C\c1cccnc1
: