Target
Retinol-binding protein 4
Ligand
BDBM249486
Substrate
Meas. Tech.
TR-FRET Assay
pH
7.5±n/a
Temperature
277.15±n/a K
IC50
14.718925±n/a nM
Comments
extracted
Citation
 Petrukhin, KCioffi, CJohnson, GAllikmets, RFreeman, EChen, PConlon, MZhu, L Substituted 4-phenylpiperidines, their preparation and use US Patent  US9434727 Publication Date 9/6/2016 
Target
Name:
Retinol-binding protein 4
Synonyms:
PRBP RBP RET4_HUMAN Retinol-binding protein 4 (RBP4) | spa binding assay for rbp4
Type:
Protein
Mol. Mass.:
23008.75
Organism:
Homo sapiens (Human)
Description:
P02753
Residue:
201
  
Inhibitor
Name:
BDBM249486
Synonyms:
US10072016, Compound 84 US10913746, Compound 84 US9434727, 84 | US9777010, Compound 84
Type:
Small organic molecule
Emp. Form.:
C21H21F5N4O2
Mol. Mass.:
456.4091
SMILES:
CCC(=O)N1Cc2[nH]nc(C(=O)N3CCC(CC3)c3ccc(F)c(F)c3C(F)(F)F)c2C1
: