Target
C-X-C motif chemokine 10
Ligand
BDBM249577
Substrate
Meas. Tech.
Radioligand Binding Assay
Temperature
298.15±n/a K
IC50
23±n/a nM
Comments
extracted
Citation
 Bata, IBartane Bodor, VVasas, ABuzder-Lantos, PFerenczy, GTomoskozi, ZSzeleczky, GSzamosvolgyi, Z Substituted B-amino acid derivatives as CXCR3 receptor antagonists US Patent  US9447038 Publication Date 9/20/2016 
Target
Name:
C-X-C motif chemokine 10
Synonyms:
C-X-C motif chemokine 10 (CXCL10) CXL10_HUMAN SCYB10
Type:
Enzyme
Mol. Mass.:
10892.04
Organism:
Homo sapiens (Human)
Description:
P02778
Residue:
98
  
Inhibitor
Name:
BDBM249577
Synonyms:
US9447038, 5
Type:
Small organic molecule
Emp. Form.:
C28H34ClN3O6
Mol. Mass.:
544.039
SMILES:
COc1cc(CN(CC(C)C)[C@@H](CC(O)=O)c2ccc(Cl)cc2)ccc1OCCn1c(=O)ccn(C)c1=O
: