Target
C-X-C motif chemokine 10
Ligand
BDBM249628
Substrate
Meas. Tech.
Radioligand Binding Assay
Temperature
298.15±n/a K
IC50
52±n/a nM
Comments
extracted
Citation
 Bata, IBartane Bodor, VVasas, ABuzder-Lantos, PFerenczy, GTomoskozi, ZSzeleczky, GSzamosvolgyi, Z Substituted B-amino acid derivatives as CXCR3 receptor antagonists US Patent  US9447038 Publication Date 9/20/2016 
Target
Name:
C-X-C motif chemokine 10
Synonyms:
C-X-C motif chemokine 10 (CXCL10) CXL10_HUMAN SCYB10
Type:
Enzyme
Mol. Mass.:
10892.04
Organism:
Homo sapiens (Human)
Description:
P02778
Residue:
98
  
Inhibitor
Name:
BDBM249628
Synonyms:
US9447038, 56
Type:
Small organic molecule
Emp. Form.:
C28H32ClFN2O5
Mol. Mass.:
531.015
SMILES:
OC(=O)CC(N(CC1CCCC1)Cc1ccc(OCCN2C(=O)CCC2=O)c(F)c1)c1ccc(Cl)cc1
: