Target
C-X-C motif chemokine 10
Ligand
BDBM249648
Substrate
Meas. Tech.
Radioligand Binding Assay
Temperature
298.15±n/a K
IC50
54±n/a nM
Comments
extracted
Citation
 Bata, IBartane Bodor, VVasas, ABuzder-Lantos, PFerenczy, GTomoskozi, ZSzeleczky, GSzamosvolgyi, Z Substituted B-amino acid derivatives as CXCR3 receptor antagonists US Patent  US9447038 Publication Date 9/20/2016 
Target
Name:
C-X-C motif chemokine 10
Synonyms:
C-X-C motif chemokine 10 (CXCL10) CXL10_HUMAN SCYB10
Type:
Enzyme
Mol. Mass.:
10892.04
Organism:
Homo sapiens (Human)
Description:
P02778
Residue:
98
  
Inhibitor
Name:
BDBM249648
Synonyms:
US9447038, 76
Type:
Small organic molecule
Emp. Form.:
C27H32ClFN2O5
Mol. Mass.:
519.005
SMILES:
CCCCN(Cc1ccc(OCCN2C(=O)CCC2=O)c(C)c1)C(CC(O)=O)c1ccc(Cl)c(F)c1
: