Target
C-X-C motif chemokine 10
Ligand
BDBM249696
Substrate
Meas. Tech.
Radioligand Binding Assay
Temperature
298.15±n/a K
IC50
30±n/a nM
Comments
extracted
Citation
 Bata, IBartane Bodor, VVasas, ABuzder-Lantos, PFerenczy, GTomoskozi, ZSzeleczky, GSzamosvolgyi, Z Substituted B-amino acid derivatives as CXCR3 receptor antagonists US Patent  US9447038 Publication Date 9/20/2016 
Target
Name:
C-X-C motif chemokine 10
Synonyms:
C-X-C motif chemokine 10 (CXCL10) CXL10_HUMAN SCYB10
Type:
Enzyme
Mol. Mass.:
10892.04
Organism:
Homo sapiens (Human)
Description:
P02778
Residue:
98
  
Inhibitor
Name:
BDBM249696
Synonyms:
US9447038, 124
Type:
Small organic molecule
Emp. Form.:
C28H31Cl2N3O6
Mol. Mass.:
576.468
SMILES:
COc1cc(CN(CC2CC2)C(CC(O)=O)c2ccc(Cl)c(Cl)c2)ccc1OCCn1c(=O)ccn(C)c1=O
: