Target
C-X-C motif chemokine 10
Ligand
BDBM249712
Substrate
Meas. Tech.
Radioligand Binding Assay
Temperature
298.15±n/a K
IC50
51±n/a nM
Comments
extracted
Citation
 Bata, IBartane Bodor, VVasas, ABuzder-Lantos, PFerenczy, GTomoskozi, ZSzeleczky, GSzamosvolgyi, Z Substituted B-amino acid derivatives as CXCR3 receptor antagonists US Patent  US9447038 Publication Date 9/20/2016 
Target
Name:
C-X-C motif chemokine 10
Synonyms:
C-X-C motif chemokine 10 (CXCL10) CXL10_HUMAN SCYB10
Type:
Enzyme
Mol. Mass.:
10892.04
Organism:
Homo sapiens (Human)
Description:
P02778
Residue:
98
  
Inhibitor
Name:
BDBM249712
Synonyms:
US9447038, 140
Type:
Small organic molecule
Emp. Form.:
C30H38N2O6
Mol. Mass.:
522.6325
SMILES:
CCCCN(Cc1ccc(CCCN2C(=O)CCC2=O)c(OC)c1)C(CC(O)=O)c1ccc2OCCc2c1
: