Target
C-X-C motif chemokine 10
Ligand
BDBM249760
Substrate
Meas. Tech.
Radioligand Binding Assay
Temperature
298.15±n/a K
IC50
31±n/a nM
Comments
extracted
Citation
 Bata, IBartane Bodor, VVasas, ABuzder-Lantos, PFerenczy, GTomoskozi, ZSzeleczky, GSzamosvolgyi, Z Substituted B-amino acid derivatives as CXCR3 receptor antagonists US Patent  US9447038 Publication Date 9/20/2016 
Target
Name:
C-X-C motif chemokine 10
Synonyms:
C-X-C motif chemokine 10 (CXCL10) CXL10_HUMAN SCYB10
Type:
Enzyme
Mol. Mass.:
10892.04
Organism:
Homo sapiens (Human)
Description:
P02778
Residue:
98
  
Inhibitor
Name:
BDBM249760
Synonyms:
US9447038, 188
Type:
Small organic molecule
Emp. Form.:
C29H35ClN2O5S
Mol. Mass.:
559.117
SMILES:
COc1cc(CN(CC2CCCC2)C(CC(O)=O)c2ccc(Cl)cc2)ccc1SCCN1C(=O)CCC1=O
: