Target
Prokineticin receptor 1
Ligand
BDBM250534
Substrate
Meas. Tech.
Biological Assay
pH
7.4±n/a
Temperature
310.15±n/a K
IC50
790±n/a nM
Comments
extracted
Citation
 Carroll, CGoldby, ATeall, M Sulfonyl piperidine derivatives and their use for treating prokineticin mediated diseases US Patent  US9475795 Publication Date 10/25/2016 
Target
Name:
Prokineticin receptor 1
Synonyms:
G-protein coupled receptor 73 GPR73 PK-R1 PKR1_HUMAN | PROKR1
Type:
enzyme
Mol. Mass.:
44779.92
Organism:
Homo sapiens (Human)
Description:
Q8TCW9
Residue:
393
  
Inhibitor
Name:
BDBM250534
Synonyms:
US10167273, Example 13 US11512066, Example 13 | US9475795, 13
Type:
Small organic molecule
Emp. Form.:
C17H21Cl2N3O3S
Mol. Mass.:
418.338
SMILES:
Cc1nn(C)c(C)c1S(=O)(=O)N1CCC(CC1)Oc1ccc(Cl)cc1Cl
: