Target
Dual specificity protein kinase TTK
Ligand
BDBM251783
Substrate
Meas. Tech.
Kinase Assay
pH
7.7±n/a
Temperature
295.15±n/a K
IC50
40.8±n/a nM
Comments
extracted
Citation
 Klar, UKoppitz, MKosemund, DBohlmann, RBader, BLienau, PSiemeister, GPrechtl, SNguyen, DScott, W Imidazopyrazines US Patent  US9468642 Publication Date 10/18/2016 
Target
Name:
Dual specificity protein kinase TTK
Synonyms:
Dual specificity protein kinase (TTK) MPS1 Monopolar Spindle 1 (MPS1) Monopolar Spindle 1 Kinase (MPS1) TTK | TTK_HUMAN
Type:
Protein
Mol. Mass.:
97086.79
Organism:
Homo sapiens (Human)
Description:
P33981
Residue:
857
  
Inhibitor
Name:
BDBM251783
Synonyms:
US9468642, 27
Type:
Small organic molecule
Emp. Form.:
C27H22N4O2S
Mol. Mass.:
466.554
SMILES:
O=C(NC1CC1)c1ccc(cc1)-c1cnc2c(SCc3ccco3)nc(cn12)-c1ccccc1
: