Target
Coagulation factor XI
Ligand
BDBM251890
Substrate
Meas. Tech.
Inhibition Assay
pH
7.4±n/a
Temperature
295.15±n/a K
IC50
340±n/a nM
Comments
extracted
Citation
 Röhrig, SHillisch, AStraβburger, JHeitmeier, SSchmidt, MVSchlemmer, KBuchmüller, AGerdes, CTeller, HSchäfer, MTersteegen, A Substituted oxopyridine derivatives and use thereof as factor xia/plasma US Patent  US9475809 Publication Date 10/25/2016 
Target
Name:
Coagulation factor XI
Synonyms:
Coagulation factor XIa Coagulation factor XIa light chain FA11_HUMAN Factor XIa PTA | Plasma thromboplastin antecedent
Type:
Enzyme
Mol. Mass.:
70130.58
Organism:
Homo sapiens (Human)
Description:
P03951
Residue:
625
  
Inhibitor
Name:
BDBM251890
Synonyms:
US9475809, 2 | US9918969, 2
Type:
Small organic molecule
Emp. Form.:
C23H17Cl2N7O3
Mol. Mass.:
510.332
SMILES:
CN1Cc2c(C1=O)c(cc(=O)n2CC(=O)Nc1ccc(cc1)-c1nnn[nH]1)-c1cc(Cl)ccc1Cl
: