Target
Coagulation factor XI
Ligand
BDBM251899
Substrate
Meas. Tech.
Inhibition Assay
pH
7.4±n/a
Temperature
295.15±n/a K
IC50
750±n/a nM
Comments
extracted
Citation
 Röhrig, SHillisch, AStraβburger, JHeitmeier, SSchmidt, MVSchlemmer, KBuchmüller, AGerdes, CTeller, HSchäfer, MTersteegen, A Substituted oxopyridine derivatives and use thereof as factor xia/plasma US Patent  US9475809 Publication Date 10/25/2016 
Target
Name:
Coagulation factor XI
Synonyms:
Coagulation factor XIa Coagulation factor XIa light chain FA11_HUMAN Factor XIa PTA | Plasma thromboplastin antecedent
Type:
Enzyme
Mol. Mass.:
70130.58
Organism:
Homo sapiens (Human)
Description:
P03951
Residue:
625
  
Inhibitor
Name:
BDBM251899
Synonyms:
US9475809, 11 | US9918969, 11
Type:
Small organic molecule
Emp. Form.:
C26H18ClF3N4O4
Mol. Mass.:
542.894
SMILES:
FC(F)(F)c1ccc(Cl)cc1-c1cc(=O)n(CC(=O)Nc2ccc(cc2)-c2cc(=O)[nH][nH]2)c2CCC(=O)c12
: