Target
Melanocortin receptor 4
Ligand
BDBM135630
Substrate
Meas. Tech.
Competitive Binding Assay Using Eu-NDP-a-MSH
Temperature
310.15±n/a K
Ki
0.7±n/a nM
Comments
extracted
Citation
 Shi, YSharma, SDDodd, JHYang, W Melanocortin receptor-specific heptapeptides US Patent  US9458201 Publication Date 10/4/2016 
Target
Name:
Melanocortin receptor 4
Synonyms:
MC4-R MC4R_HUMAN Melanocortin receptor 4 (MC-4) Melanocortin receptor 4 (MC4R)
Type:
Enzyme
Mol. Mass.:
36949.50
Organism:
Homo sapiens (Human)
Description:
P32245
Residue:
332
  
Inhibitor
Name:
BDBM135630
Synonyms:
US10179804, Example 15 US8846601, 15 | US9458201, 15
Type:
Small organic molecule
Emp. Form.:
C56H76N16O10
Mol. Mass.:
1133.3038
SMILES:
CC(=O)N[C@@H](CCCNC(N)=N)C(=O)N[C@H]1CC(=O)NCCCC[C@H](NC(=O)[C@H](Cc2c[nH]c3ccccc23)NC(=O)[C@H](CCCNC(N)=N)NC(=O)[C@@H](Cc2ccccc2)NC(=O)[C@@H]2C[C@H](CN2C1=O)OCc1ccccc1)C(N)=O
: