Target
Melanocortin receptor 4
Ligand
BDBM135724
Substrate
Meas. Tech.
Competitive Binding Assay Using Eu-NDP-a-MSH
Temperature
310.15±n/a K
Ki
6±n/a nM
Comments
extracted
Citation
 Shi, YSharma, SDDodd, JHYang, W Melanocortin receptor-specific heptapeptides US Patent  US9458201 Publication Date 10/4/2016 
Target
Name:
Melanocortin receptor 4
Synonyms:
MC4-R MC4R_HUMAN Melanocortin receptor 4 (MC-4) Melanocortin receptor 4 (MC4R)
Type:
Enzyme
Mol. Mass.:
36949.50
Organism:
Homo sapiens (Human)
Description:
P32245
Residue:
332
  
Inhibitor
Name:
BDBM135724
Synonyms:
US10179804, Example 109 US8846601, 109 | US9458201, 109
Type:
Small organic molecule
Emp. Form.:
C52H74N18O9
Mol. Mass.:
1095.2592
SMILES:
CCNC(=O)[C@@H]1CCCNC(=O)CC[C@H](NC(=O)[C@H](CCCNC(N)=N)NC(C)=O)C(=O)N[C@@H](Cc2c[nH]cn2)C(=O)N[C@H](Cc2ccccc2)C(=O)N[C@@H](CCCNC(N)=N)C(=O)N[C@@H](Cc2c[nH]c3ccccc23)C(=O)N1
: