Target
Sodium channel protein type 9 subunit alpha
Ligand
BDBM50118514
Substrate
Meas. Tech.
Electrophysiological Assay (In vitro Assay)
IC50
0.3±n/a nM
Citation
 Liu, SFocken, TChahal, NZhang, ZOballa, RMFonarev, J Biaryl ether sulfonamides and their use as therapeutic agents US Patent  US9481677 Publication Date 11/1/2016 
Target
Name:
Sodium channel protein type 9 subunit alpha
Synonyms:
NENA Peripheral sodium channel 1 SCN9A_HUMAN Voltage-gated sodium channel subunit Nav1.7 hNE-Na
Type:
Protein
Mol. Mass.:
226375.97
Organism:
Homo sapiens (Human)
Description:
Q15858
Residue:
1988
  
Inhibitor
Name:
BDBM50118514
Synonyms:
CHEMBL3617063 | US9481677, 38
Type:
Small organic molecule
Emp. Form.:
C21H13ClF2N6O3S2
Mol. Mass.:
534.946
SMILES:
Nc1nc2cc(ccc2[nH]1)-c1cc(Cl)ccc1Oc1cc(F)c(cc1F)S(=O)(=O)Nc1ncns1
: