Target
Amine oxidase [flavin-containing] B
Ligand
BDBM254552
Substrate
Meas. Tech.
Fluorescence-Based (Inhibitor)-Screening Assay
pH
7.5±n/a
Temperature
310.15±n/a K
Ki
20000±n/a nM
Comments
extracted
Citation
 Ortega Muñoz, AFyfe, MCMartinell Pedemonte, MEstiarte Martínez, MValls Vidal, NKurz, GCastro Palomino Laria, JC (Hetero)aryl cyclopropylamine compounds as LSD1 inhibitors US Patent  US9469597 Publication Date 10/18/2016 
Target
Name:
Amine oxidase [flavin-containing] B
Synonyms:
AOFB_HUMAN MAOB Monoamine oxidase type B (MAO B) Monoamine oxidase type B (MAOB)
Type:
Protein
Mol. Mass.:
58768.76
Organism:
Homo sapiens (Human)
Description:
P27338
Residue:
520
  
Inhibitor
Name:
BDBM254552
Synonyms:
US9469597, 11 | US9670136, 11 4-(((trans)-2-(6-(3-(trifluoromethyl)phenyl)pyridin-3-yl)cyclopropyl)amino)cyclohexanol
Type:
Small organic molecule
Emp. Form.:
C21H23F3N2O
Mol. Mass.:
376.4153
SMILES:
OC1CCC(CC1)N[C@H]1C[C@@H]1c1ccc(nc1)-c1cccc(c1)C(F)(F)F
: