Target
Amine oxidase [flavin-containing] B
Ligand
BDBM254547
Substrate
Meas. Tech.
Fluorescence-Based (Inhibitor)-Screening Assay
pH
7.5±n/a
Temperature
310.15±n/a K
IC50
>100000±n/a nM
Comments
extracted
Citation
 Ortega Muñoz, AFyfe, MCMartinell Pedemonte, MEstiarte Martínez, MValls Vidal, NKurz, GCastro Palomino Laria, JC (Hetero)aryl cyclopropylamine compounds as LSD1 inhibitors US Patent  US9469597 Publication Date 10/18/2016 
Target
Name:
Amine oxidase [flavin-containing] B
Synonyms:
AOFB_HUMAN MAOB Monoamine oxidase type B (MAO B) Monoamine oxidase type B (MAOB)
Type:
Protein
Mol. Mass.:
58768.76
Organism:
Homo sapiens (Human)
Description:
P27338
Residue:
520
  
Inhibitor
Name:
BDBM254547
Synonyms:
US10214477, Example 6 US9670136, 6 N1-((trans)-2-(thiazol-5-yl)cyclopropyl)cyclohexane-1,4-diamine
Type:
Small organic molecule
Emp. Form.:
C12H19N3S
Mol. Mass.:
237.364
SMILES:
NC1CCC(CC1)N[C@H]1C[C@@H]1c1cncs1
: