Target
Toll-like receptor 8
Ligand
BDBM254748
Substrate
Meas. Tech.
Pharmacological Assay
EC50
2±n/a nM
Citation
 Hoves, SWang, LYun, HZhang, WZhu, W Benzazepine dicarboxamide compounds US Patent  US9475775 Publication Date 10/25/2016 
Target
Name:
Toll-like receptor 8
Synonyms:
CD_antigen: CD288 TLR8_HUMAN | TRL8
Type:
Enzyme
Mol. Mass.:
119828.77
Organism:
Homo sapiens (Human)
Description:
Q9NR97
Residue:
1041
  
Inhibitor
Name:
BDBM254748
Synonyms:
US9475775, 15 | US9597333, 15
Type:
Small organic molecule
Emp. Form.:
C29H35N5O3
Mol. Mass.:
501.6199
SMILES:
CCCN(CCC)C(=O)C1=Cc2ccc(cc2N=C(N)C1)C(=O)Nc1cccc(c1)C(=O)N1CCCC1
: