Target
Leucine-rich repeat serine/threonine-protein kinase 2 [G2019S]
Ligand
BDBM254934
Substrate
Meas. Tech.
Homogeneous Time Resolved-fluorescence Resonance Energy Transfer (TR-FRET) Assay
pH
8.5±n/a
Temperature
303.15±n/a K
IC50
527±n/a nM
Comments
extracted
Citation
 Bedford, STChen, IWang, YWilliamson, DS Arylpyrrolopyridine derived compounds as LRRK2 inhibitors US Patent  US9499542 Publication Date 11/22/2016 
Target
Name:
Leucine-rich repeat serine/threonine-protein kinase 2 [G2019S]
Synonyms:
LRRK2 LRRK2_HUMAN Leucine-rich repeat serine/threonine-protein kinase 2 (LRRK2)(G2019S) PARK8
Type:
Mol. Mass.:
286143.23
Organism:
Homo sapiens (Human)
Description:
Q5S007(G2019S)
Residue:
2527
  
Inhibitor
Name:
BDBM254934
Synonyms:
US9499542, 17 | US9675594, 17
Type:
Small organic molecule
Emp. Form.:
C19H13N5
Mol. Mass.:
311.34
SMILES:
N#Cc1c[nH]c2nc(Nc3ccccn3)cc(-c3ccccc3)c12
: