Target
Orexin/Hypocretin receptor type 1
Ligand
BDBM164140
Substrate
Meas. Tech.
Radioligand Binding Assay
Temperature
277.15±n/a K
Ki
325±n/a nM
Comments
extracted
Citation
 Coate, HRDvorak, CALebold, TPPreville, CShireman, BT Substituted 7-azabicycles and their use as orexin receptor modulators US Patent  US9475819 Publication Date 10/25/2016 
Target
Name:
Orexin/Hypocretin receptor type 1
Synonyms:
Hcrtr1 OX1R_RAT Orexin receptor type 1 (OX1R) Ox1-R | Ox1R
Type:
Protein
Mol. Mass.:
46817.55
Organism:
Rattus norvegicus (Rat)
Description:
P56718
Residue:
416
  
Inhibitor
Name:
BDBM164140
Synonyms:
BDBM255252 US9637496, 270 | US9695183, 270
Type:
Small organic molecule
Emp. Form.:
C23H19BrFN7O
Mol. Mass.:
508.346
SMILES:
Fc1cccc(C(=O)N2C3CCC2C(C3)Nc2nccn3c(Br)cnc23)c1-c1ncccn1
: