Target
Alpha-1,3-mannosyl-glycoprotein 2-beta-N-acetylglucosaminyltransferase
Ligand
BDBM294232
Substrate
Meas. Tech.
Biological Assay
Ki
<10000±n/a nM
Citation
 Amberg, WPohlki, FLange, UWang, YBrewer, JVasudevan, ALao, YHutchins, CZhao, HLi, H Aminotetraline and aminoindane derivatives, pharmaceutical compositions containing them, and their use in therapy US Patent  US9586942 Publication Date 3/7/2017 
Target
Name:
Alpha-1,3-mannosyl-glycoprotein 2-beta-N-acetylglucosaminyltransferase
Synonyms:
GGNT1 GLYT1 GlcNAc-T I MGAT1 N-glycosyl-oligosaccharide-glycoprotein N-acetylglucosaminyltransferase I
Type:
PROTEIN
Mol. Mass.:
50891.32
Organism:
Homo sapiens (Human)
Description:
ChEMBL_107587
Residue:
445
  
Inhibitor
Name:
BDBM294232
Synonyms:
N-(1-((7S,8R)-7-(azetidin-1-yl)-8-benzyl-5,6,7,8-tetrahydronaphthalen-2-yl)azetidin-3-yl)-2,2-difluorobenzo[d][1,3]dioxole-5-sulfonamide | US9586942, 6
Type:
Small organic molecule
Emp. Form.:
C30H31F2N3O4S
Mol. Mass.:
567.647
SMILES:
FC1(F)Oc2ccc(cc2O1)S(=O)(=O)NC1CN(C1)c1ccc2CC[C@@H]([C@H](Cc3ccccc3)c2c1)N1CCC1
: