Target
Alpha-1,3-mannosyl-glycoprotein 2-beta-N-acetylglucosaminyltransferase
Ligand
BDBM294239
Substrate
Meas. Tech.
Biological Assay
Ki
<100.0±n/a nM
Citation
 Amberg, WPohlki, FLange, UWang, YBrewer, JVasudevan, ALao, YHutchins, CZhao, HLi, H Aminotetraline and aminoindane derivatives, pharmaceutical compositions containing them, and their use in therapy US Patent  US9586942 Publication Date 3/7/2017 
Target
Name:
Alpha-1,3-mannosyl-glycoprotein 2-beta-N-acetylglucosaminyltransferase
Synonyms:
GGNT1 GLYT1 GlcNAc-T I MGAT1 N-glycosyl-oligosaccharide-glycoprotein N-acetylglucosaminyltransferase I
Type:
PROTEIN
Mol. Mass.:
50891.32
Organism:
Homo sapiens (Human)
Description:
ChEMBL_107587
Residue:
445
  
Inhibitor
Name:
BDBM294239
Synonyms:
N-((1 S,3s)-3-((7S,8R)-7-(azetidin-1-yl)-8-benzyl-5,6,7,8-tetrahydronaphthalen-2-yl)cyclobutyl)-1-methyl-1H-imidazole-4-sulfonamide | US9586942, 13
Type:
Small organic molecule
Emp. Form.:
C28H34N4O2S
Mol. Mass.:
490.66
SMILES:
Cn1cnc(c1)S(=O)(=O)N[C@H]1C[C@H](C1)c1ccc2CC[C@@H]([C@H](Cc3ccccc3)c2c1)N1CCC1
: