Target
Alpha-1,3-mannosyl-glycoprotein 2-beta-N-acetylglucosaminyltransferase
Ligand
BDBM294240
Substrate
Meas. Tech.
Biological Assay
Ki
<100.0±n/a nM
Citation
 Amberg, WPohlki, FLange, UWang, YBrewer, JVasudevan, ALao, YHutchins, CZhao, HLi, H Aminotetraline and aminoindane derivatives, pharmaceutical compositions containing them, and their use in therapy US Patent  US9586942 Publication Date 3/7/2017 
Target
Name:
Alpha-1,3-mannosyl-glycoprotein 2-beta-N-acetylglucosaminyltransferase
Synonyms:
GGNT1 GLYT1 GlcNAc-T I MGAT1 N-glycosyl-oligosaccharide-glycoprotein N-acetylglucosaminyltransferase I
Type:
PROTEIN
Mol. Mass.:
50891.32
Organism:
Homo sapiens (Human)
Description:
ChEMBL_107587
Residue:
445
  
Inhibitor
Name:
BDBM294240
Synonyms:
N-((S)-1-((7S,8R)-7-(azetidin-1-yl)-8-benzyl-5,6,7,8-tetrahydronaphthalen-2-yl)-2-oxopyrrolidin-3-yl)propane-1-sulfonamide | US9586942, 14
Type:
Small organic molecule
Emp. Form.:
C27H35N3O3S
Mol. Mass.:
481.65
SMILES:
CCCS(=O)(=O)N[C@H]1CCN(C1=O)c1ccc2CC[C@@H]([C@H](Cc3ccccc3)c2c1)N1CCC1
: