Target
Alpha-1,3-mannosyl-glycoprotein 2-beta-N-acetylglucosaminyltransferase
Ligand
BDBM294242
Substrate
Meas. Tech.
Biological Assay
Ki
<10.00±n/a nM
Citation
 Amberg, WPohlki, FLange, UWang, YBrewer, JVasudevan, ALao, YHutchins, CZhao, HLi, H Aminotetraline and aminoindane derivatives, pharmaceutical compositions containing them, and their use in therapy US Patent  US9586942 Publication Date 3/7/2017 
Target
Name:
Alpha-1,3-mannosyl-glycoprotein 2-beta-N-acetylglucosaminyltransferase
Synonyms:
GGNT1 GLYT1 GlcNAc-T I MGAT1 N-glycosyl-oligosaccharide-glycoprotein N-acetylglucosaminyltransferase I
Type:
PROTEIN
Mol. Mass.:
50891.32
Organism:
Homo sapiens (Human)
Description:
ChEMBL_107587
Residue:
445
  
Inhibitor
Name:
BDBM294242
Synonyms:
N-(1-((7S,8R)-8-benzyl-7-(3-azabicyclo[3.1.0]hexan-3-yl)-5,6,7,8-tetrahydronaphthalen-2-yl)azetidin-3-yl)-1-methyl-1H-1,2,3-triazole-4-sulfonamide | US9586942, 16
Type:
Small organic molecule
Emp. Form.:
C28H34N6O2S
Mol. Mass.:
518.674
SMILES:
Cn1cc(nn1)S(=O)(=O)NC1CN(C1)c1ccc2CC[C@@H]([C@H](Cc3ccccc3)c2c1)N1CC2CC2C1
: