Target
Fibroblast growth factor receptor 1 [400-80]/Glutathione S-transferase P
Ligand
BDBM255632
Substrate
Meas. Tech.
High ATP Kinase Assay
pH
7±n/a
Temperature
295.15±n/a K
IC50
27.3±n/a nM
Comments
extracted
Citation
 Lobell, MHübsch, WSchirok, HHéroult, MBrohm, DCollin, MGrünewald, SLustig, KBömer, UVoehringer, VLindner, N Substituted benzothienyl-pyrrolotriazines and uses thereof US Patent  US9475815 Publication Date 10/25/2016 
Target
Name:
Fibroblast growth factor receptor 1 [400-80]/Glutathione S-transferase P
Synonyms:
GST-Fibroblast growth factor receptor 1 (FGFR-1)
Type:
Protein
Mol. Mass.:
Description:
Components:
This complex has 2 components.
Component 1
Name:
Glutathione S-transferase P
Synonyms:
FAEES3 GST3 GSTP1-1 Glutathione S-transferase Glutathione S-transferase P Glutathione transferase (GST)
Type:
Enzyme
Mol. Mass.:
23353.53
Organism:
Homo sapiens (Human)
Description:
P09211
Residue:
210
  
Component 2
Name:
Fibroblast growth factor receptor 1 [400-800]
Synonyms:
BFGFR FGFBR FGFR1_HUMAN FLT2 HBGFR
Type:
Protein
Mol. Mass.:
45097.70
Organism:
Homo sapiens (Human)
Description:
aa 400-800
Residue:
401
  
Inhibitor
Name:
BDBM255632
Synonyms:
US9475815, 17
Type:
Small organic molecule
Emp. Form.:
C24H29N7O2S
Mol. Mass.:
479.598
SMILES:
COc1cc(C)cc2cc(sc12)-c1cc(CN2CCNC(C2)C(=O)N(C)C)n2ncnc(N)c12
: