Target
Proto-oncogene tyrosine-protein kinase Src
Ligand
BDBM256611
Substrate
Meas. Tech.
Enzyme Inhibition Assay
IC50
72±n/a nM
Citation
 Baker, TMFyfe, MCHarbottle, GWHasimbegovic, VMeghani, PRigby, ASambrook-Smith, CThom, SM Kinase inhibitors US Patent  US9481648 Publication Date 11/1/2016 
Target
Name:
Proto-oncogene tyrosine-protein kinase Src
Synonyms:
Calmodulin/Proto-oncogene tyrosine-protein kinase Src Proto-oncogene c-Src SRC SRC_HUMAN V-src sarcoma (Schmidt-Ruppin A-2) viral oncogene homolog (avian) p60-Src | pp60c-src
Type:
Protein
Mol. Mass.:
59838.60
Organism:
Homo sapiens (Human)
Description:
P12931
Residue:
536
  
Inhibitor
Name:
BDBM256611
Synonyms:
US10435361, Example 85(m) US9790174, Example 85(m)
Type:
Small organic molecule
Emp. Form.:
C44H53N7O8S
Mol. Mass.:
839.999
SMILES:
COc1cc(Nc2cc(Oc3ccc(NC(=O)Nc4cc(cc(NS(C)(=O)=O)c4OC)C(C)(C)C)c4ccccc34)ccn2)cc(c1)C(=O)NCCN1CCOC(C)(C)C1
: